{"text_format":"1","workbook":"xlsx","n_sheets":6,"sheets":["Header Entry","Item Entry","Associates CSV","Lines CSV","Combined CSV","Country Codes Lookup"],"not_rendered":{"charts":0,"images":1,"macros":1,"external_links":0,"defined_names":2,"comments":2,"pivot_tables":0},"unopened":[],"bounds":{"document_bytes":16777216,"sheet_cells":100000,"rows_first":2000,"rows_last":500,"rows_between":2000,"halvings":0,"cell_chars":16384,"cell_head_chars":4096},"cells_cut":0,"cells_raw":0,"read":"whole","date_system":"1900"}

{"sheet":"Header Entry","index":0,"n_rows":107,"n_cols":32,"rows_kept":107,"cut":false,"hidden":false,"merged":[[66,10,66,17],[56,10,56,17],[56,2,56,9],[57,2,57,9],[58,2,58,3],[61,2,61,9],[61,10,61,17],[57,10,57,17],[58,10,58,11],[6,2,6,4],[6,6,6,7],[10,2,10,3],[14,23,14,24],[35,2,35,9],[6,12,7,15],[31,2,31,9],[14,17,14,20],[14,1,14,6],[22,2,22,9],[18,7,18,9],[18,2,18,5],[17,2,17,9],[32,2,32,3],[27,2,27,5],[23,2,23,3],[53,2,53,5],[8,2,8,3],[9,2,9,3],[8,5,8,7],[9,5,9,7],[12,1,12,5],[11,4,11,5],[12,6,12,9],[27,7,27,9],[30,2,30,9],[20,2,20,9],[21,2,21,9],[36,2,36,4],[36,8,36,9],[26,2,26,9],[29,2,29,9],[47,10,47,17],[48,10,48,17],[44,10,44,13],[44,15,44,17],[52,10,52,17],[49,10,49,11],[55,10,55,17],[39,2,39,9],[40,2,40,4],[53,7,53,9],[52,2,52,9],[49,2,49,3],[47,2,47,9],[48,2,48,9],[43,2,43,9],[44,2,44,5],[44,7,44,9],[46,2,46,9],[40,8,40,9],[43,10,43,17],[46,10,46,17],[53,10,53,13],[1,2,1,8],[2,2,2,8],[69,1,69,9],[53,15,53,17],[67,2,67,3],[67,10,67,11],[65,10,65,17],[62,2,62,5],[62,7,62,9],[62,10,62,13],[62,15,62,17],[65,2,65,9],[66,2,66,9],[64,2,64,9],[64,10,64,17],[55,2,55,9]]}
[null,null,null,null,null,null,null,null,null,null,null,null,null,null,null,null,null,null,null,null,null,null,null,null,null,null,null,null,null,null,null,"ALABAMA"]
[null,null,"U.S. IMPORTER SECURITY FILING SUBMISSION FORM",null,null,null,null,null,null,null,null,null,null,null,null,null,null,null,null,null,null,null,null,null,"CBP#",null,null,null,null,null,null,"ALASKA"]
[null,null,"For all ocean bound cargo to the United States",null,null,null,null,null,null,null,null,null,null,null,null,null,null,null,null,null,null,null,null,null,"EIN",null,null,null,null,null,null,"AMERICAN SAMOA"]
[null,null,null,null,null,null,null,null,null,null,null,null,null,null,null,null,null,null,null,null,null,null,null,null,"SSN",null,null,"CFS",null,null,null,"ARIZONA"]
[null,"Summary of Shipment Information",null,null,null,null,null,null,null,null,null,null,null,null,null,null,null,null,null,null,null,null,null,null,null,null,null,"CY",null,null,null,"ARKANSAS"]
[null,null,null,null,null,null,null,null,null,null,null,null,"TIPS",null,null,null,null,null,null,null,null,null,null,null,null,null,null,null,null,null,null,"CALIFORNIA"]
[null,"  Customer Reference:",null,null,null,"Vendor",null,null,"Move Type:",null,null,null,"*Data elements in bold are required in order to successfully upload the filing to exp.o ISF.",null,null,null,null,null,null,null,null,null,null,null,null,null,null,null,null,null,null,"COLORADO"]
[null,null,null,null,null,null,null,null,null,null,null,null,null,null,null,null,null,null,null,null,null,null,null,null,null,null,null,null,null,null,null,"CONNECTICUT"]
[null,"  ISF Cut-Off Date:",null,null,"Vessel:",null,null,null,"Origin:",null,null,"CY","* Key filing data into the fields shaded in blue",null,null,null,null,null,null,null,null,null,null,null,null,null,null,null,null,null,null,"DELAWARE"]
[null,"  Vessel Sailing Date:",null,null,"Voyage:",null,null,null,"Destination:",null,null,"CFS","*Dates should be entered in the format MM/DD/YY",null,null,null,null,null,null,null,null,null,null,null,null,null,null,null,null,null,null,"DISTRICT OF COLUMBIA"]
{"$rows_left_out":98}
{"sheet":"Item Entry","index":1,"n_rows":122,"n_cols":13,"rows_kept":122,"cut":false,"hidden":false,"merged":[[118,8,118,9],[119,5,119,6],[119,8,119,9],[117,5,117,6],[117,8,117,9],[109,8,109,9],[110,5,110,6],[110,8,110,9],[108,8,108,9],[111,5,111,6],[115,8,115,9],[116,5,116,6],[116,8,116,9],[112,8,112,9],[113,5,113,6],[113,8,113,9],[114,5,114,6],[114,8,114,9],[105,8,105,9],[111,8,111,9],[106,8,106,9],[107,5,107,6],[107,8,107,9],[108,5,108,6],[88,8,88,9],[89,5,89,6],[89,8,89,9],[93,8,93,9],[94,8,94,9],[95,5,95,6],[95,8,95,9],[91,5,91,6],[91,8,91,9],[92,5,92,6],[99,8,99,9],[100,8,100,9],[101,5,101,6],[101,8,101,9],[97,8,97,9],[98,5,98,6],[98,8,98,9],[96,5,96,6],[47,8,47,9],[51,8,51,9],[52,8,52,9],[53,5,53,6],[53,8,53,9],[50,5,50,6],[50,8,50,9],[49,8,49,9],[48,5,48,6],[48,8,48,9],[47,5,47,6],[49,5,49,6],[34,8,34,9],[31,8,31,9],[32,5,32,6],[32,8,32,9],[33,5,33,6],[30,8,30,9],[34,5,34,6],[9,2,9,10],[11,2,11,10],[31,5,31,6],[28,5,28,6],[25,5,25,6],[27,5,27,6],[30,5,30,6],[27,8,27,9],[28,8,28,9],[29,5,29,6],[29,8,29,9],[33,8,33,9],[14,2,14,6],[5,1,5,10],[7,2,7,10],[25,8,25,9],[26,5,26,6],[26,8,26,9],[16,2,16,10],[17,2,17,10],[18,2,18,10],[19,2,19,3],[21,8,21,9],[21,5,21,6],[24,5,24,6],[24,8,24,9],[22,5,22,6],[23,5,23,6],[22,8,22,9],[23,8,23,9],[14,8,14,10],[37,8,37,9],[38,5,38,6],[38,8,38,9],[36,5,36,6],[36,8,36,9],[35,5,35,6],[35,8,35,9],[40,5,40,6],[39,5,39,6],[37,5,37,6],[42,5,42,6],[42,8,42,9],[39,8,39,9],[40,8,40,9],[41,5,41,6],[41,8,41,9],[45,8,45,9],[46,8,46,9],[45,5,45,6],[46,5,46,6],[43,5,43,6],[43,8,43,9],[44,5,44,6],[44,8,44,9],[56,8,56,9],[54,5,54,6],[54,8,54,9],[52,5,52,6],[51,5,51,6],[55,5,55,6],[55,8,55,9],[58,5,58,6],[57,5,57,6],[56,5,56,6],[62,8,62,9],[60,5,60,6],[60,8,60,9],[57,8,57,9],[58,8,58,9],[59,5,59,6],[59,8,59,9],[61,5,61,6],[61,8,61,9],[62,5,62,6],[64,5,64,6],[63,5,63,6],[67,5,67,6],[67,8,67,9],[68,5,68,6],[68,8,68,9],[66,5,66,6],[66,8,66,9],[63,8,63,9],[64,8,64,9],[65,5,65,6],[65,8,65,9],[70,5,70,6],[69,5,69,6],[79,8,79,9],[78,5,78,6],[78,8,78,9],[72,5,72,6],[72,8,72,9],[69,8,69,9],[70,8,70,9],[71,5,71,6],[71,8,71,9],[75,8,75,9],[76,8,76,9],[73,5,73,6],[73,8,73,9],[75,5,75,6],[77,5,77,6],[79,5,79,6],[76,5,76,6],[96,8,96,9],[81,5,81,6],[74,5,74,6],[74,8,74,9],[77,8,77,9],[81,8,81,9],[82,8,82,9],[83,5,83,6],[88,5,88,6],[87,5,87,6],[86,5,86,6],[80,5,80,6],[80,8,80,9],[85,5,85,6],[85,8,85,9],[86,8,86,9],[84,5,84,6],[84,8,84,9],[82,5,82,6],[83,8,83,9],[1,1,1,10],[2,1,2,10],[109,5,109,6],[121,1,121,10],[118,5,118,6],[115,5,115,6],[106,5,106,6],[105,5,105,6],[112,5,112,6],[100,5,100,6],[99,5,99,6],[103,5,103,6],[103,8,103,9],[104,5,104,6],[104,8,104,9],[102,5,102,6],[102,8,102,9],[92,8,92,9],[90,5,90,6],[90,8,90,9],[87,8,87,9],[94,5,94,6],[93,5,93,6],[97,5,97,6]]}
[]
[null,"U.S. IMPORTER SECURITY FILING SUBMISSION FORM"]
[null,"For all ocean bound cargo to the United States"]
[]
[]
[null,"Each Item Requires Manufacture Name & Address/ Country of Origin/ Commodity HTSUS Number"]
[null,"Manufacturer Name & Address"]
[null,"Definition","Name and address of the entity that last manufactures, assembles, produces, or grows the commodity or name and address of the party supplying the finished goods in the country from which the goods are leaving.  In the alternative the name and address of the manufacturer (or supplier) that is currently required by the import laws, rules and regulations of the United States (i.e., entry procedures) may be provided (this is the information that is used to create the existing manufacture (MID) number for entry purposes). "]
[null,"Country of Origin",null,null,null,null,null,null,null,null,"Must be a valid 2 letter country code"]
[null,"Definition","Country of manufacture, production, or growth of the article, based upon the import laws, rules and regulations of the United States."]
{"$rows_left_out":113}
{"sheet":"Associates CSV","index":2,"n_rows":8,"n_cols":14,"rows_kept":8,"cut":false,"hidden":true,"merged":[]}
["Associate Type","Name","Address1","Address2","Address3","Address4","Address5","Address6","Country","City","State","Postal","Number Type","Number"]
["SELLER",{"$f":"IF('Header Entry'!$C$19=0,\"\", 'Header Entry'!$C$19)","v":""},{"$f":"IF('Header Entry'!$C$21=0,\"\", 'Header Entry'!$C$21)","v":""},{"$f":"IF('Header Entry'!$C$22=0,\"\", 'Header Entry'!$C$22)","v":""},{"$f":"IF('Header Entry'!$C$23=0,\"\", 'Header Entry'!$C$23)","v":""},null,null,null,{"$f":"IF('Header Entry'!$J$24=0,\"\", 'Header Entry'!$J$24)","v":""},{"$f":"IF('Header Entry'!$C$24=0,\"\", 'Header Entry'!$C$24)","v":""},{"$f":"IF('Header Entry'!$F$24=0,\"\", 'Header Entry'!$F$24)","v":""},{"$f":"IF('Header Entry'!$H$24=0,\"\", 'Header Entry'!$H$24)","v":""},{"$f":"IF('Header Entry'!H19=\"\",\"\",\"DUNS#\")","v":""},{"$f":"IF('Header Entry'!$H$19=0,\"\", 'Header Entry'!$H$19)","v":""}]
["BUYER",{"$f":"IF('Header Entry'!$C$28=0,\"\", 'Header Entry'!$C$28)","v":""},{"$f":"IF('Header Entry'!$C$30=0,\"\", 'Header Entry'!$C$30)","v":""},{"$f":"IF('Header Entry'!$C$31=0,\"\", 'Header Entry'!$C$31)","v":""},{"$f":"IF('Header Entry'!$C$32=0,\"\", 'Header Entry'!$C$32)","v":""},null,null,null,{"$f":"IF('Header Entry'!$J$33=0,\"\", 'Header Entry'!$J$33)","v":""},{"$f":"IF('Header Entry'!$C$33=0,\"\", 'Header Entry'!$C$33)","v":""},{"$f":"IF('Header Entry'!$F$33=0,\"\", 'Header Entry'!$F$33)","v":""},{"$f":"IF('Header Entry'!$H$33=0,\"\", 'Header Entry'!$H$33)","v":""},{"$f":"IF('Header Entry'!H28=\"\",\"\",\"DUNS#\")","v":""},{"$f":"IF('Header Entry'!$H$28=0,\"\", 'Header Entry'!$H$28)","v":""}]
["SHIP_TO",{"$f":"IF('Header Entry'!$C$45=0,\"\", 'Header Entry'!$C$45)","v":""},{"$f":"IF('Header Entry'!$C$47=0,\"\", 'Header Entry'!$C$47)","v":" "},{"$f":"IF('Header Entry'!$C$48=0,\"\", 'Header Entry'!$C$48)","v":" "},{"$f":"IF('Header Entry'!$C$49=0,\"\", 'Header Entry'!$C$49)","v":" "},null,null,null,{"$f":"IF('Header Entry'!$J$50=0,\"\", 'Header Entry'!$J$50)","v":" "},{"$f":"IF('Header Entry'!$C$50=0,\"\", 'Header Entry'!$C$50)","v":" "},{"$f":"IF('Header Entry'!$F$50=0,\"\", 'Header Entry'!$F$50)","v":""},{"$f":"IF('Header Entry'!$H$50=0,\"\", 'Header Entry'!$H$50)","v":" "},{"$f":"IF('Header Entry'!H45=\"\",\"\",\"DUNS#\")","v":""},{"$f":"IF('Header Entry'!$H$45=0,\"\", 'Header Entry'!$H$45)","v":""}]
["CONSIGNEE",{"$f":"IF('Header Entry'!$C$41=0,\"\", 'Header Entry'!$C$41)","v":""},null,null,null,null,null,null,null,null,null,null,{"$f":"IF('Header Entry'!$H$41=0,\"\", 'Header Entry'!$H$41)","v":""},{"$f":"IF('Header Entry'!$I$41=0,\"\", 'Header Entry'!$I$41)","v":""}]
["CONSOLIDATOR",{"$f":"IF('Header Entry'!$C$54=0,\"\", 'Header Entry'!$C$54)","v":""},{"$f":"IF('Header Entry'!$C$56=0,\"\", 'Header Entry'!$C$56)","v":""},{"$f":"IF('Header Entry'!$C$57=0,\"\", 'Header Entry'!$C$57)","v":""},{"$f":"IF('Header Entry'!$C$58=0,\"\", 'Header Entry'!$C$58)","v":""},null,null,null,{"$f":"IF('Header Entry'!$J$59=0,\"\", 'Header Entry'!$J$59)","v":""},{"$f":"IF('Header Entry'!$C$59=0,\"\", 'Header Entry'!$C$59)","v":""},{"$f":"IF('Header Entry'!$F$59=0,\"\", 'Header Entry'!$F$59)","v":""},{"$f":"IF('Header Entry'!$H$59=0,\"\", 'Header Entry'!$H$59)","v":""},{"$f":"IF('Header Entry'!H54=\"\",\"\",\"DUNS#\")","v":""},{"$f":"IF('Header Entry'!$H$54=0,\"\", 'Header Entry'!$H$54)","v":""}]
["STUFFING_LOCATION",{"$f":"IF('Header Entry'!$C$63=0,\"\", 'Header Entry'!$C$63)","v":""},{"$f":"IF('Header Entry'!$C$65=0,\"\", 'Header Entry'!$C$65)","v":""},{"$f":"IF('Header Entry'!$C$66=0,\"\", 'Header Entry'!$C$66)","v":""},{"$f":"IF('Header Entry'!$C$67=0,\"\", 'Header Entry'!$C$67)","v":""},null,null,null,{"$f":"IF('Header Entry'!$J$68=0,\"\", 'Header Entry'!$J$68)","v":""},{"$f":"IF('Header Entry'!$C$68=0,\"\", 'Header Entry'!$C$68)","v":""},{"$f":"IF('Header Entry'!$F$68=0,\"\", 'Header Entry'!$F$68)","v":""},{"$f":"IF('Header Entry'!$H$68=0,\"\", 'Header Entry'!$H$68)","v":""},{"$f":"IF('Header Entry'!H63=\"\",\"\",\"DUNS#\")","v":""},{"$f":"IF('Header Entry'!$H$63=0,\"\", 'Header Entry'!$H$63)","v":""}]
["MANUFACTURER",{"$f":"IF('Item Entry'!$C$15=0,\"\", 'Item Entry'!$C$15)","v":""},{"$f":"IF('Item Entry'!$C$17=0,\"\", 'Item Entry'!$C$17)","v":""},{"$f":"IF('Item Entry'!$C$18=0,\"\", 'Item Entry'!$C$18)","v":""},{"$f":"IF('Item Entry'!$C$19=0,\"\", 'Item Entry'!$C$19)","v":""},null,null,null,{"$f":"IF('Item Entry'!$K$20=0,\"\", 'Item Entry'!$K$20)","v":" "},{"$f":"IF('Item Entry'!$C$20=0,\"\", 'Item Entry'!$C$20)","v":" "},{"$f":"IF('Item Entry'!$G$20=0,\"\", 'Item Entry'!$G$20)","v":""},{"$f":"IF('Item Entry'!$I$20=0,\"\", 'Item Entry'!$I$20)","v":" "},{"$f":"IF('Item Entry'!I15=\"\",\"\",\"DUNS#\")","v":""},{"$f":"IF('Item Entry'!$I$15=0,\"\", 'Item Entry'!$I$15)","v":""}]

{"sheet":"Lines CSV","index":3,"n_rows":99,"n_cols":6,"rows_kept":99,"cut":false,"hidden":true,"merged":[]}
["Manufacturer Name","Item Number ","Description ","HS Tariff","Country of Origin","PO Number "]
[{"$f":"IF(AND(B2=\"\", D2=\"\", E2=\"\", F2=\"\"), \"\", 'Associates CSV'!$B$8)","v":""},{"$f":"IF('Item Entry'!B23=\"\", \"\", 'Item Entry'!B23)","v":""},null,{"$f":"IF('Item Entry'!F23=\"\", \"\", 'Item Entry'!F23)","v":""},{"$f":"IF('Item Entry'!H23=\"\", \"\", 'Item Entry'!H23)","v":""},{"$f":"IF('Item Entry'!I23=\"\", \"\", 'Item Entry'!I23)","v":""}]
[{"$f":"IF(AND(B3=\"\", D3=\"\", E3=\"\", F3=\"\"), \"\", 'Associates CSV'!$B$8)","v":""},{"$f":"IF('Item Entry'!B24=\"\", \"\", 'Item Entry'!B24)","v":""},null,{"$f":"IF('Item Entry'!F24=\"\", \"\", 'Item Entry'!F24)","v":""},{"$f":"IF('Item Entry'!H24=\"\", \"\", 'Item Entry'!H24)","v":""},{"$f":"IF('Item Entry'!I24=\"\", \"\", 'Item Entry'!I24)","v":""}]
[{"$f":"IF(AND(B4=\"\", D4=\"\", E4=\"\", F4=\"\"), \"\", 'Associates CSV'!$B$8)","v":""},{"$f":"IF('Item Entry'!B25=\"\", \"\", 'Item Entry'!B25)","v":""},null,{"$f":"IF('Item Entry'!F25=\"\", \"\", 'Item Entry'!F25)","v":""},{"$f":"IF('Item Entry'!H25=\"\", \"\", 'Item Entry'!H25)","v":""},{"$f":"IF('Item Entry'!I25=\"\", \"\", 'Item Entry'!I25)","v":""}]
[{"$f":"IF(AND(B5=\"\", D5=\"\", E5=\"\", F5=\"\"), \"\", 'Associates CSV'!$B$8)","v":""},{"$f":"IF('Item Entry'!B26=\"\", \"\", 'Item Entry'!B26)","v":""},null,{"$f":"IF('Item Entry'!F26=\"\", \"\", 'Item Entry'!F26)","v":""},{"$f":"IF('Item Entry'!H26=\"\", \"\", 'Item Entry'!H26)","v":""},{"$f":"IF('Item Entry'!I26=\"\", \"\", 'Item Entry'!I26)","v":""}]
[{"$f":"IF(AND(B6=\"\", D6=\"\", E6=\"\", F6=\"\"), \"\", 'Associates CSV'!$B$8)","v":""},{"$f":"IF('Item Entry'!B27=\"\", \"\", 'Item Entry'!B27)","v":""},null,{"$f":"IF('Item Entry'!F27=\"\", \"\", 'Item Entry'!F27)","v":""},{"$f":"IF('Item Entry'!H27=\"\", \"\", 'Item Entry'!H27)","v":""},{"$f":"IF('Item Entry'!I27=\"\", \"\", 'Item Entry'!I27)","v":""}]
[{"$f":"IF(AND(B7=\"\", D7=\"\", E7=\"\", F7=\"\"), \"\", 'Associates CSV'!$B$8)","v":""},{"$f":"IF('Item Entry'!B28=\"\", \"\", 'Item Entry'!B28)","v":""},null,{"$f":"IF('Item Entry'!F28=\"\", \"\", 'Item Entry'!F28)","v":""},{"$f":"IF('Item Entry'!H28=\"\", \"\", 'Item Entry'!H28)","v":""},{"$f":"IF('Item Entry'!I28=\"\", \"\", 'Item Entry'!I28)","v":""}]
[{"$f":"IF(AND(B8=\"\", D8=\"\", E8=\"\", F8=\"\"), \"\", 'Associates CSV'!$B$8)","v":""},{"$f":"IF('Item Entry'!B29=\"\", \"\", 'Item Entry'!B29)","v":""},null,{"$f":"IF('Item Entry'!F29=\"\", \"\", 'Item Entry'!F29)","v":""},{"$f":"IF('Item Entry'!H29=\"\", \"\", 'Item Entry'!H29)","v":""},{"$f":"IF('Item Entry'!I29=\"\", \"\", 'Item Entry'!I29)","v":""}]
[{"$f":"IF(AND(B9=\"\", D9=\"\", E9=\"\", F9=\"\"), \"\", 'Associates CSV'!$B$8)","v":""},{"$f":"IF('Item Entry'!B30=\"\", \"\", 'Item Entry'!B30)","v":""},null,{"$f":"IF('Item Entry'!F30=\"\", \"\", 'Item Entry'!F30)","v":""},{"$f":"IF('Item Entry'!H30=\"\", \"\", 'Item Entry'!H30)","v":""},{"$f":"IF('Item Entry'!I30=\"\", \"\", 'Item Entry'!I30)","v":""}]
[{"$f":"IF(AND(B10=\"\", D10=\"\", E10=\"\", F10=\"\"), \"\", 'Associates CSV'!$B$8)","v":""},{"$f":"IF('Item Entry'!B31=\"\", \"\", 'Item Entry'!B31)","v":""},null,{"$f":"IF('Item Entry'!F31=\"\", \"\", 'Item Entry'!F31)","v":""},{"$f":"IF('Item Entry'!H31=\"\", \"\", 'Item Entry'!H31)","v":""},{"$f":"IF('Item Entry'!I31=\"\", \"\", 'Item Entry'!I31)","v":""}]
{"$rows_left_out":90}
{"sheet":"Combined CSV","index":4,"n_rows":291,"n_cols":15,"rows_kept":291,"cut":false,"hidden":false,"merged":[]}
["BOL Issuer","BOL Number  ","BOL Type ","Cut-off Date  ","Origin Port  ","Destination Port  ","Move Type","Customer Reference","Vendor ID","Carrier Code","Vessel","Voyage","Port of Destination","Port of Discharge ETA","Port of Discharge Location"]
[{"$f":"IF('Header Entry'!$C$12=\"\",'Header Entry'!$H$12, IF('Header Entry'!$E$12<>\"\",'Header Entry'!$C$12))","v":0},{"$f":"IF('Header Entry'!$E$12=\"\",'Header Entry'!$J$12,'Header Entry'!$E$12)","v":0},{"$f":"IF('Header Entry'!$E$12<>0,\"HOUSE\",IF('Header Entry'!$J$12<>0,\"MASTER\"))","v":false},{"$f":"IF('Header Entry'!C9=\"\",\"\",'Header Entry'!C9)","v":""},{"$f":"IF('Header Entry'!J9=\"\",\"\",'Header Entry'!J9)","v":""},{"$f":"IF('Header Entry'!J10=\"\",\"\",'Header Entry'!J10)","v":""},{"$f":"IF('Header Entry'!J7=\"\",\"\",'Header Entry'!J7)","v":""},{"$f":"IF('Header Entry'!C7=\"\",\"\",'Header Entry'!C7)","v":""},null,{"$f":"IF('Header Entry'!H12=\"\",\"\",'Header Entry'!H12)","v":""},{"$f":"IF('Header Entry'!$F$9=\"\",\"\", 'Header Entry'!$F$9)","v":""},{"$f":"IF('Header Entry'!$F$10=\"\",\"\", 'Header Entry'!$F$10)","v":""},{"$f":"IF('Header Entry'!J10=\"\",\"\",'Header Entry'!J10)","v":""},null,{"$f":"IF('Header Entry'!J10=\"\",\"\",'Header Entry'!J10)","v":""}]
["Associate Type","Name","Address1","Address2","Address3","Address4","Address5","Address6","Country","City","State","Postal","Number Type","Number"]
["SELLER",{"$f":"IF('Header Entry'!C19=\"\",\"\",'Header Entry'!C19)","v":""},{"$f":"IF('Header Entry'!C21=\"\",\"\",'Header Entry'!C21)","v":""},{"$f":"IF('Header Entry'!C22=\"\",\"\",'Header Entry'!C22)","v":""},{"$f":"IF('Header Entry'!C23=\"\",\"\",'Header Entry'!C23)","v":""},null,null,null,{"$f":"IF('Header Entry'!J24=\"\",\"\",'Header Entry'!J24)","v":""},{"$f":"IF('Header Entry'!$C$24=0,\"\", 'Header Entry'!$C$24)","v":""},{"$f":"IF('Header Entry'!F24=0,\"\", 'Header Entry'!F24)","v":""},{"$f":"IF('Header Entry'!$H$24=0,\"\", 'Header Entry'!$H$24)","v":""},{"$f":"IF('Header Entry'!H19=\"\",\"\",\"DUNS#\")","v":""},{"$f":"IF('Header Entry'!$H$19=0,\"\", 'Header Entry'!$H$19)","v":""}]
["BUYER",{"$f":"IF('Header Entry'!$C$28=0,\"\", 'Header Entry'!$C$28)","v":""},{"$f":"IF('Header Entry'!$C$30=0,\"\", 'Header Entry'!$C$30)","v":""},{"$f":"IF('Header Entry'!$C$31=0,\"\", 'Header Entry'!$C$31)","v":""},{"$f":"IF('Header Entry'!$C$32=0,\"\", 'Header Entry'!$C$32)","v":""},null,null,null,{"$f":"IF('Header Entry'!$J$33=0,\"\", 'Header Entry'!$J$33)","v":""},{"$f":"IF('Header Entry'!$C$33=0,\"\", 'Header Entry'!$C$33)","v":""},{"$f":"IF('Header Entry'!F33=\"\",\"\", 'Header Entry'!F33)","v":""},{"$f":"IF('Header Entry'!$H$33=0,\"\", 'Header Entry'!$H$33)","v":""},{"$f":"IF('Header Entry'!H28=\"\",\"\",\"DUNS#\")","v":""},{"$f":"IF('Header Entry'!$H$28=0,\"\", 'Header Entry'!$H$28)","v":""}]
["SHIP_TO",{"$f":"IF('Header Entry'!$C$45=0,\"\", 'Header Entry'!$C$45)","v":""},{"$f":"IF('Header Entry'!$C$47=0,\"\", 'Header Entry'!$C$47)","v":" "},{"$f":"IF('Header Entry'!$C$48=0,\"\", 'Header Entry'!$C$48)","v":" "},{"$f":"IF('Header Entry'!$C$49=0,\"\", 'Header Entry'!$C$49)","v":" "},null,null,null,{"$f":"IF('Header Entry'!$J$50=0,\"\", 'Header Entry'!$J$50)","v":" "},{"$f":"IF('Header Entry'!$C$50=0,\"\", 'Header Entry'!$C$50)","v":" "},{"$f":"IF('Header Entry'!$F$50=0,\"\", 'Header Entry'!$F$50)","v":""},{"$f":"IF('Header Entry'!$H$50=0,\"\", 'Header Entry'!$H$50)","v":" "},{"$f":"IF('Header Entry'!H45=\"\",\"\",\"DUNS#\")","v":""},{"$f":"IF('Header Entry'!$H$45=0,\"\", 'Header Entry'!$H$45)","v":""}]
["CONSIGNEE",{"$f":"IF('Header Entry'!$C$41=0,\"\", 'Header Entry'!$C$41)","v":""},null,null,null,null,null,null,null,null,null,null,{"$f":"IF('Header Entry'!H41=\"\",\"\",'Header Entry'!H41)","v":""},{"$f":"IF('Header Entry'!$I$41=0,\"\", 'Header Entry'!$I$41)","v":""}]
["CONSOLIDATOR",{"$f":"IF('Header Entry'!$C$54=0, \" \", 'Header Entry'!$C$54)","v":" "},{"$f":"IF('Header Entry'!$C$56=0, \" \", 'Header Entry'!$C$56)","v":" "},{"$f":"IF('Header Entry'!$C$57=0, \" \", 'Header Entry'!$C$57)","v":" "},{"$f":"IF('Header Entry'!$C$58=0, \" \", 'Header Entry'!$C$58)","v":" "},null,null,null,{"$f":"IF('Header Entry'!J59=\"\",\"\",'Header Entry'!J59)","v":""},{"$f":"IF('Header Entry'!C59=\"\",\"\", 'Header Entry'!C59)","v":""},{"$f":"IF('Header Entry'!$F$59=0,\"\", 'Header Entry'!$F$59)","v":""},{"$f":"IF('Header Entry'!$H$59=0,\"\", 'Header Entry'!$H$59)","v":""},{"$f":"IF('Header Entry'!H54=\"\",\"\",\"DUNS#\")","v":""},{"$f":"IF('Header Entry'!$H$54=0,\"\", 'Header Entry'!$H$54)","v":""}]
["STUFFING_LOCATION",{"$f":"IF('Header Entry'!$C$63=0, \" \", 'Header Entry'!$C$63)","v":" "},{"$f":"IF('Header Entry'!$C$65=0, \" \", 'Header Entry'!$C$65)","v":" "},{"$f":"IF('Header Entry'!$C$66=0, \" \", 'Header Entry'!$C$66)","v":" "},{"$f":"IF('Header Entry'!$C$67=0, \" \", 'Header Entry'!$C$67)","v":" "},null,null,null,{"$f":"IF('Header Entry'!J68=\"\",\"\",'Header Entry'!J68)","v":""},{"$f":"IF('Header Entry'!$C$68=0,\"\", 'Header Entry'!$C$68)","v":""},{"$f":"IF('Header Entry'!$F$68=0,\"\", 'Header Entry'!$F$68)","v":""},{"$f":"IF('Header Entry'!$H$68=0,\"\", 'Header Entry'!$H$68)","v":""},{"$f":"IF('Header Entry'!H63=\"\",\"\",\"DUNS#\")","v":""},{"$f":"IF('Header Entry'!$H$63=0,\"\", 'Header Entry'!$H$63)","v":""}]
["MANUFACTURER",{"$f":"IF('Item Entry'!$C$15=0,\"\", 'Item Entry'!$C$15)","v":""},{"$f":"IF('Item Entry'!$C$17=0,\"\", 'Item Entry'!$C$17)","v":""},{"$f":"IF('Item Entry'!$C$18=0,\"\", 'Item Entry'!$C$18)","v":""},{"$f":"IF('Item Entry'!$C$19=0,\"\", 'Item Entry'!$C$19)","v":""},null,null,null,{"$f":"IF('Item Entry'!K20=\"\",\"\", 'Item Entry'!K20)","v":" "},{"$f":"IF('Item Entry'!$C$20=0,\"\", 'Item Entry'!$C$20)","v":" "},{"$f":"IF('Item Entry'!$G$20=0,\"\", 'Item Entry'!$G$20)","v":""},{"$f":"IF('Item Entry'!$I$20=0,\"\", 'Item Entry'!$I$20)","v":" "},{"$f":"IF('Item Entry'!I15=\"\",\"\",\"DUNS#\")","v":""},{"$f":"IF('Item Entry'!$I$15=0,\"\", 'Item Entry'!$I$15)","v":""}]
{"$rows_left_out":282}
{"sheet":"Country Codes Lookup","index":5,"n_rows":251,"n_cols":2,"rows_kept":251,"cut":false,"hidden":true,"merged":[]}
["Country Name","ISO 3166-1-alpha-2 code"]
["AFGHANISTAN","AF"]
["ÅLAND ISLANDS","AX"]
["ALBANIA","AL"]
["ALGERIA","DZ"]
["AMERICAN SAMOA","AS"]
["ANDORRA","AD"]
["ANGOLA","AO"]
["ANGUILLA","AI"]
["ANTARCTICA","AQ"]
{"$rows_left_out":241}